{"text_format":"1","workbook":"xlsx","n_sheets":3,"sheets":["Feuil1","Feuil2","Feuil3"],"not_rendered":{"charts":1,"images":6,"macros":1,"external_links":0,"defined_names":3,"comments":0,"pivot_tables":0},"unopened":[],"bounds":{"document_bytes":16777216,"sheet_cells":100000,"rows_first":2000,"rows_last":500,"rows_between":2000,"halvings":0,"cell_chars":16384,"cell_head_chars":4096},"cells_cut":0,"cells_raw":0,"read":"whole","date_system":"1900"}

{"sheet":"Feuil1","index":0,"n_rows":328,"n_cols":50,"rows_kept":328,"cut":false,"hidden":false,"merged":[[30,46,30,48],[31,46,31,48],[32,46,32,48],[33,46,33,48],[35,0,35,16],[32,6,34,8],[32,9,34,10],[32,11,34,15],[33,1,34,3],[33,4,34,4],[36,0,36,17],[0,0,0,16],[2,1,2,4],[3,6,3,13],[23,29,23,31],[16,7,19,13],[19,5,19,6],[4,1,4,3],[10,1,10,3],[8,1,8,4],[7,1,7,3],[13,1,13,3],[4,26,4,27],[11,1,11,3],[11,6,13,6],[3,1,3,4],[18,1,18,4],[27,29,27,30],[29,46,29,48],[5,1,5,3],[12,1,12,3],[7,6,9,6],[2,17,14,17],[14,1,14,3],[28,29,28,30],[21,1,21,3],[23,1,23,3],[28,1,28,3],[26,1,26,4],[27,1,27,3],[29,1,29,3],[19,1,19,3]]}
["SIMULATION D'INVESTISSEMENT MEUBLE CLES EN MAIN COLOC INVEST"]
[]
[null,"L'APPARTEMENT"]
[null,{"$f":"IF(E7=\"Concept Impossible\",\"Le concept nécessite au moins 2 chambres !!!\",\"\")","v":""},null,null,null,null,"Estimation de l'évolution des loyers et des charges :",null,null,null,null,null,null,null,null,null,{"$f":"VLOOKUP(U21,T6:Z20,7,FALSE)/1000","v":124.34944237918216},null,null,null,null,null,null,null,null,null,null,null,null,null,null,null,null,null,null,null,null,"Amorti.","prêt"]
[null,"Lieu de l'investissement",null,null,null,null,null,null,null,null,null,null,null,null,null,null,null,null,null,null,"budget","ingenierie","mobilier","achat et trav","Notaire","Achat appt","Chambres",null,"Loyer","m2",null,"Type","Assurance","Gestion","Copro","Charges","taxe fonc","immo + mob","int. + ass","résultat"]
[null,"Montant d'investissement souhaité *",null,null,null,null,null,null,null,null,null,null,null,null,null,null,null,null,null,1,120000,{"$f":"U6*10%","v":12000},{"$f":"6200+(1400*AA6)","v":10400},{"$f":"U6-V6-W6","v":97600},{"$f":"Z6*9%","v":8058.7155963302748},{"$f":"U6-V6-W6-Y6","v":89541.284403669721},{"$f":"VLOOKUP(AE6,$AG$26:$AH$225,2,TRUE)","v":3},{"$f":"VLOOKUP(AD6,$AH$25:$AI$31,2,TRUE)","v":0},{"$f":"$AB$29*AD6","v":763.04746709214191},{"$f":"Z6/$AC$29","v":77.86198643797367},{"$f":"ROUND(AD6,1)","v":77.900000000000006},{"$f":"VLOOKUP(AD6,AG26:AI225,3,TRUE)","v":"T4"},180,{"$f":"(AC6+(90*AA6))*(12-$U$47)*6%*1.2","v":818.17359393697632},{"$f":"12*AD6","v":934.34383725568409},{"$f":"SUM(AG6:AI6)","v":1932.5174311926603},{"$f":"(AD6*10)+500","v":1278.6198643797366},{"$f":"((U6-W6)*0.9*3.33%)+W6*10%","v":4324.7120000000004},{"$f":"-$AT$29","v":289.33333333333337},{"$f":"(AC6*11)-AJ6-AK6-AM6-AL6","v":568.33950910783096}]
[null,{"$f":"IF(E7=\"Concept impossible\",\"Augmentez le montant investi\",CONCATENATE(E7,\" chambres\"))","v":"3 chambres"},null,null,{"$f":"IF(VLOOKUP($AD$21,$AG$26:$AH$225,2,FALSE)=1,\"Concept Impossible\",VLOOKUP($AD$21,$AG$26:$AH$225,2,FALSE))","v":3},null,null,null,null,null,null,null,null,null,null,null,null,null,null,2,130000,{"$f":"U7*10%","v":13000},{"$f":"5700+(1500*AA7)","v":10200},{"$f":"U7-V7-W7","v":106800},{"$f":"Z7*8.8%","v":8638.2352941176468},{"$f":"U7-V7-W7-Y7","v":98161.76470588235},3,0,{"$f":"$AB$29*AD7","v":836.50895140664954},{"$f":"Z7/$AC$29","v":85.358056265984658},{"$f":"ROUND(AD7,1)","v":85.4},"T5",180,{"$f":"(AC7+(90*AA7))*(12-$U$47)*6%*1.2","v":876.35508951406632},{"$f":"12*AD7","v":1024.2966751918159},{"$f":"SUM(AG7:AI7)","v":2080.6517647058822},{"$f":"(AD7*10)+500","v":1353.5805626598467},{"$f":"((U7-W7)*0.9*3.33%)+W7*10%","v":4610.4060000000009},{"$f":"-$AT$29","v":289.33333333333337},{"$f":"(AC7*11)-AJ7-AK7-AM7-AL7","v":867.6268047740823}]
[null,"Surface habitable",null,null,{"$f":"VLOOKUP($U$21,$T$6:$AG$20,11,FALSE)","v":108.12994989494101},null,{"$f":"E11/U22","v":8.6632901575504045E-2},null,null,null,null,null,null,null,null,null,null,null,null,3,140000,14000,{"$f":"5700+(1500*AA8)","v":10200},115800,{"$f":"Z8*8.4%","v":8973.4317343173443},106826.56826568265,3,0,910.34814695973046,92.892668057115358,92.9,"T5",180,{"$f":"(AC8+(90*AA8))*(12-$U$47)*6%*1.2","v":934.83573239210637},1114.7120166853842,2229.5477490774906,{"$f":"(AD8*10)+800","v":1728.9266805711536},4910.1059999999998,289.33333333333337,855.91585357505846]
[null,"* Prix total acte en main, mobilier et agencement compris.",null,null,null,null,null,null,null,null,null,null,null,null,null,null,null,null,null,4,150000,15000,10200,124800,{"$f":"Z9*8%","v":9244.4444444444453},115555.55555555556,3,0,{"$f":"$AB$29*AD9","v":984.73429951690821},100.48309178743962,100.5,"T5",200,993.74956521739114,1205.7971014492755,2399.5466666666666,{"$f":"(AD9*10)+800","v":1804.8309178743962},5209.8060000000005,289.33333333333337,1128.5603768115934]
[null,"Estimation de la vacance locative",null,null,null,null,null,null,null,null,null,null,null,null,null,null,null,null,null,5,160000,16000,10200,133800,{"$f":"Z10*7.6%","v":9450.5576208178445},124349.44237918216,3,0,{"$f":"$AB$29*AD10","v":1059.6735089704218},108.12994989494101,108.1,"T5",200,1053.101419104574,1297.5593987392922,2550.6608178438664,1881.29949894941,5509.5060000000003,289.33333333333337,1425.6089485480306]
[null,"Montant de la location annuelle :",null,null,{"$f":"IF(E7=\"Concept impossible\",0,E12*(12-$U$47))","v":11656.40859867464},null,null,null,null,null,null,null,null,null,null,null,null,null,null,6,170000,17000,11700,141300,{"$f":"Z11*7.3%","v":9613.1407269338288},131686.85927306616,4,0,{"$f":"$AB$29*AD11","v":1122.2010616313464},114.51031241136188,114.5,"T5",200,1173.9032408120263,1374.1237489363425,2748.0269897483686,1945.1031241136188,5914.2510000000002,289.33333333333337,1447.4972307494909]
[null,"Estimation des loyers mensuels HC",null,null,{"$f":"IF(E7=\"Concept impossible\",0,VLOOKUP($U$21,$T$6:$AG$20,10,FALSE))","v":1059.6735089704218},null,{"$f":"E15/U22","v":5.3693632274756646E-2},null,null,null,null,null,null,null,null,null,null,null,null,7,180000,18000,11700,150300,{"$f":"Z12*7.1%","v":9963.8655462184852},140336.1344537815,4,0,1195.9079283887465,122.03142126415783,122,{"$f":"VLOOKUP(AD12,AG33:AI231,3,TRUE)","v":"T6"},220,1232.2790792838871,1464.377055169894,2916.6561344537813,2020.3142126415783,6213.9510000000009,289.33333333333337,1714.7325318475168]
[null,"Frais divers annuels (gestion, syndic, assur.)",null,null,{"$f":"IF(E7=\"Concept impossible\",0,VLOOKUP($U$21,$T$6:$AK$20,17,FALSE))","v":2550.6608178438664},null,null,null,null,null,null,null,null,null,null,null,null,null,null,8,190000,19000,11700,159300,{"$f":"Z13*6.9%","v":10282.2263797942},149017.77362020581,4,0,1269.8905925895795,129.58067271322244,129.6,{"$f":"VLOOKUP(AD13,AG33:AI232,3,TRUE)","v":"T6"},220,1290.8733493309467,1554.9680725586693,3065.841421889616,2095.8067271322243,6513.6510000000007,289.33333333333337,2004.1640361302007]
[null,"Taxe foncière + C.E.T.",null,null,{"$f":"IF(E7=\"Concept impossible\",0,VLOOKUP($U$21,$T$6:$AK$20,18,FALSE))","v":1881.29949894941},null,null,null,null,null,null,null,null,null,null,null,null,null,null,9,200000,20000,13200,166800,{"$f":"Z14*6.7%","v":10473.851921274601},156326.14807872541,5,0,1332.1706531926161,135.93578093802211,135.9,"T6",220,1411.4791573285518,1631.2293712562653,3262.708528584817,2159.3578093802212,6918.3960000000006,289.33333333333337,2024.0815138204052]
[null,"Loyers nets annuels",null,null,{"$f":"E11-E13-E14","v":7224.448281881364},null,null,null,null,null,null,null,null,null,null,null,null,null,null,10,210000,21000,13200,175800,{"$f":"Z15*6.5%","v":10729.577464788732},165070.42253521126,5,0,{"$f":"$AB$29*AD15","v":1406.6870789957134},143.53949785670545,143.5,"T6",250,1470.4961665646049,1722.4739742804654,{"$f":"SUM(AG15:AI15)","v":3442.9701408450701},2235.3949785670547,7218.0960000000005,289.33333333333337,2287.7634162073873]
[null,null,null,null,null,null,null,null,null,null,null,null,null,null,null,null,null,null,null,11,220000,22000,13200,184800,{"$f":"Z16*6.3%","v":10863.850976227937},173936.14902377207,5,0,1469.5064122433926,151.24882523806266,151.19999999999999,"T7",250,1520.249078496767,1814.9859028567521,3585.2349813535193,2312.4882523806264,7517.7960000000003,289.33333333333337,2459.7179676098385]
[null,"* Loyers annuels sur prix d'acquisition Hors frais d'acte",null,null,null,null,null,null,null,null,null,null,null,null,null,null,null,null,null,12,230000,23000,14700,192300,{"$f":"Z17*6.1%","v":11055.890669180018},181244.10933081998,6,0,1544.5150186452483,157.6035733311478,157.6,"T7",250,1650.9358947670366,1891.2428799737736,3792.1787747408102,2376.035733311478,7922.5410000000002,289.33333333333337,2609.5763637121081]
[null,null,null,null,null,null,null,null,null,null,null,null,null,null,null,null,null,null,null,13,240000,24000,14700,201300,{"$f":"Z18*5.9%","v":11215.014164305949},190084.98583569404,6,0,1619.8546619041751,165.2912920310383,165.3,"T7",280,1710.6048922281068,1983.4955043724594,3974.1003966005665,2452.912920310383,8222.2410000000018,289.33333333333337,2879.8136307016412]
[null,"LE FINANCEMENT",null,null,null,null,null,null,null,null,null,null,null,null,null,null,null,null,null,14,250000,25000,14700,210300,{"$f":"Z19*5.7%","v":11340.681173131505},198959.31882686849,6,0,1695.4794126115746,173.00810332771172,173,"T7",280,1770.4996947883672,2076.0972399325406,4126.5969347209084,2530.0810332771171,8521.9410000000007,289.33333333333337,3182.3212373959614]
[null,"Apport personnel possible",null,null,{"$f":"AO54","v":20000},{"$f":"IF(AO53>V21,CONCATENATE(\"Maxi \",DOLLAR(V21,0),\" !!!\"),\"\")","v":""},null,null,null,null,null,null,null,null,null,null,null,null,null,15,260000,26000,14700,219300,{"$f":"Z20*5.5%","v":11432.701421800948},207867.29857819906,6,0,1771.3908922316091,180.75417267669482,180.8,"T7",280,1830.6215866474342,2169.050072120338,4279.671658767772,2607.5417267669482,8821.6409999999996,289.33333333333337,3487.1120956796458]
{"$rows_left_out":309}
{"sheet":"Feuil2","index":1,"n_rows":38,"n_cols":15,"rows_kept":38,"cut":false,"hidden":false,"merged":[[28,14,31,16],[27,14,27,16],[3,11,5,11],[0,1,2,11],[3,5,5,5],[3,6,5,6],[3,7,5,7],[3,8,5,8],[3,9,5,9],[3,10,5,10],[3,1,5,1],[3,2,5,2],[3,3,5,3],[3,4,5,4]]}
[null,"RESULTAT FISCAL"]
[]
[]
[null,"Années","Loyers","Charges","Taxe foncière CET","Intérêts d'emprunt","Résultat ","Amort. Annuel Mobilier et immobilier","Stock Amort. Reportables","Amort. utilisés","Amort. Reportés","Résultat fiscal"]
[]
[]
[1,{"$f":"YEAR(TODAY())","v":2015},{"$f":"Feuil1!E12*(12-Feuil1!$U$47)","v":11656.40859867464},{"$f":"Feuil1!E13","v":2550.6608178438664},{"$f":"Feuil1!E14","v":1881.29949894941},{"$f":"-IF(ISERROR(VLOOKUP(A7*12,Feuil1!$AQ$29:$AT$328,4,FALSE)),0,VLOOKUP(A7*12,Feuil1!$AQ$29:$AT$328,4,FALSE))","v":3385.9461318311792},{"$f":"C7-D7-E7-F7","v":3838.5021500501848},{"$f":"VLOOKUP(Feuil1!$U$21,Feuil1!$T$6:$AN$20,19,FALSE)","v":5509.5060000000003},{"$f":"H7","v":5509.5060000000003},{"$f":"IF(G7>0,MIN(G7,I7),0)","v":3838.5021500501848},{"$f":"I7-J7","v":1671.0038499498155},{"$f":"G7-J7","v":0},{"$f":"B7","v":2015},{"$f":"IF(L7=0,0,1)","v":0}]
[2,{"$f":"B7+1","v":2016},{"$f":"C7*(100%+Feuil1!$Z$41)","v":11714.690641668012},{"$f":"D7*(100%+Feuil1!$Z$41)","v":2563.4141219330854},{"$f":"E7*(100%+Feuil1!$Z$41)","v":1890.7059964441569},{"$f":"-IF(ISERROR(VLOOKUP(A8*12,Feuil1!$AQ$29:$AT$328,4,FALSE)),0,VLOOKUP(A8*12,Feuil1!$AQ$29:$AT$328,4,FALSE))","v":3195.5561463839631},{"$f":"C8-D8-E8-F8","v":4065.0143769068072},{"$f":"VLOOKUP(Feuil1!$U$21,Feuil1!$T$6:$AN$20,19,FALSE)","v":5509.5060000000003},{"$f":"H8+K7","v":7180.5098499498163},{"$f":"IF(G8>0,MIN(G8,I8),0)","v":4065.0143769068072},{"$f":"I8-J8","v":3115.495473043009},0,{"$f":"B8","v":2016},{"$f":"IF(L8=0,0,1)","v":0}]
[3,{"$f":"B8+1","v":2017},{"$f":"C8*(100%+Feuil1!$Z$41)","v":11773.264094876351},{"$f":"D8*(100%+Feuil1!$Z$41)","v":2576.2311925427507},{"$f":"E8*(100%+Feuil1!$Z$41)","v":1900.1595264263774},{"$f":"-IF(ISERROR(VLOOKUP(A9*12,Feuil1!$AQ$29:$AT$328,4,FALSE)),0,VLOOKUP(A9*12,Feuil1!$AQ$29:$AT$328,4,FALSE))","v":3000.9739366687263},4295.8994392384957,{"$f":"VLOOKUP(Feuil1!$U$21,Feuil1!$T$6:$AN$20,19,FALSE)","v":5509.5060000000003},{"$f":"H9+K8","v":8625.0014730430084},{"$f":"IF(G9>0,MIN(G9,I9),0)","v":4295.8994392384957},{"$f":"I9-J9","v":4329.1020338045128},0,2017,0]
[4,2018,{"$f":"C9*(100%+Feuil1!$Z$41)","v":11832.130415350732},{"$f":"D9*(100%+Feuil1!$Z$41)","v":2589.1123485054641},{"$f":"E9*(100%+Feuil1!$Z$41)","v":1909.6603240585091},{"$f":"-IF(ISERROR(VLOOKUP(A10*12,Feuil1!$AQ$29:$AT$328,4,FALSE)),0,VLOOKUP(A10*12,Feuil1!$AQ$29:$AT$328,4,FALSE))","v":2802.1071935008658},4531.2505492858918,{"$f":"VLOOKUP(Feuil1!$U$21,Feuil1!$T$6:$AN$20,19,FALSE)","v":5509.5060000000003},9838.608033804514,4531.2505492858918,5307.3574845186222,0,2018,0]
[5,2019,{"$f":"C10*(100%+Feuil1!$Z$41)","v":11891.291067427484},{"$f":"D10*(100%+Feuil1!$Z$41)","v":2602.057910247991},{"$f":"E10*(100%+Feuil1!$Z$41)","v":1919.2086256788014},{"$f":"-IF(ISERROR(VLOOKUP(A11*12,Feuil1!$AQ$29:$AT$328,4,FALSE)),0,VLOOKUP(A11*12,Feuil1!$AQ$29:$AT$328,4,FALSE))","v":2598.8615751266625},4771.1629563740289,{"$f":"VLOOKUP(Feuil1!$U$21,Feuil1!$T$6:$AN$20,19,FALSE)","v":5509.5060000000003},10816.863484518622,4771.1629563740289,6045.7005281445936,0,2019,0]
[6,2020,{"$f":"C11*(100%+Feuil1!$Z$41)","v":11950.747522764621},{"$f":"D11*(100%+Feuil1!$Z$41)","v":2615.0681997992306},{"$f":"E11*(100%+Feuil1!$Z$41)","v":1928.8046688071952},{"$f":"-IF(ISERROR(VLOOKUP(A12*12,Feuil1!$AQ$29:$AT$328,4,FALSE)),0,VLOOKUP(A12*12,Feuil1!$AQ$29:$AT$328,4,FALSE))","v":2391.1406624678589},5015.7339916903366,{"$f":"VLOOKUP(Feuil1!$U$21,Feuil1!$T$6:$AN$20,19,FALSE)","v":5509.5060000000003},11555.206528144594,5015.7339916903366,6539.4725364542574,0,2020,0]
[7,2021,{"$f":"C12*(100%+Feuil1!$Z$41)","v":12010.501260378443},{"$f":"D12*(100%+Feuil1!$Z$41)","v":2628.1435407982262},{"$f":"E12*(100%+Feuil1!$Z$41)","v":1938.4486921512309},{"$f":"-IF(ISERROR(VLOOKUP(A13*12,Feuil1!$AQ$29:$AT$328,4,FALSE)),0,VLOOKUP(A13*12,Feuil1!$AQ$29:$AT$328,4,FALSE))","v":2178.8459133807478},5265.0631140482383,{"$f":"VLOOKUP(Feuil1!$U$21,Feuil1!$T$6:$AN$20,19,FALSE)","v":5509.5060000000003},12048.978536454259,5265.0631140482383,6783.9154224060203,0,2021,0]
[8,2022,{"$f":"C13*(100%+Feuil1!$Z$41)","v":12070.553766680334},{"$f":"D13*(100%+Feuil1!$Z$41)","v":2641.2842585022172},{"$f":"E13*(100%+Feuil1!$Z$41)","v":1948.1409356119868},{"$f":"-IF(ISERROR(VLOOKUP(A14*12,Feuil1!$AQ$29:$AT$328,4,FALSE)),0,VLOOKUP(A14*12,Feuil1!$AQ$29:$AT$328,4,FALSE))","v":1961.8766159080888},5519.2519566580413,{"$f":"VLOOKUP(Feuil1!$U$21,Feuil1!$T$6:$AN$20,19,FALSE)","v":5509.5060000000003},12293.42142240602,5519.2519566580413,6774.1694657479784,0,2022,0]
[9,2023,{"$f":"C14*(100%+Feuil1!$Z$41)","v":12130.906535513734},{"$f":"D14*(100%+Feuil1!$Z$41)","v":2654.4906797947278},{"$f":"E14*(100%+Feuil1!$Z$41)","v":1957.8816402900466},{"$f":"-IF(ISERROR(VLOOKUP(A15*12,Feuil1!$AQ$29:$AT$328,4,FALSE)),0,VLOOKUP(A15*12,Feuil1!$AQ$29:$AT$328,4,FALSE))","v":1740.1298405016869},5778.4043749272723,{"$f":"VLOOKUP(Feuil1!$U$21,Feuil1!$T$6:$AN$20,19,FALSE)","v":5509.5060000000003},12283.67546574798,5778.4043749272723,6505.2710908207073,0,2023,0]
[10,2024,{"$f":"C15*(100%+Feuil1!$Z$41)","v":12191.5610681913},{"$f":"D15*(100%+Feuil1!$Z$41)","v":2667.7631331937014},{"$f":"E15*(100%+Feuil1!$Z$41)","v":1967.6710484914965},{"$f":"-IF(ISERROR(VLOOKUP(A16*12,Feuil1!$AQ$29:$AT$328,4,FALSE)),0,VLOOKUP(A16*12,Feuil1!$AQ$29:$AT$328,4,FALSE))","v":1513.5003911929214},6042.6264953131813,{"$f":"VLOOKUP(Feuil1!$U$21,Feuil1!$T$6:$AN$20,19,FALSE)","v":5509.5060000000003},12014.777090820708,6042.6264953131813,5972.1505955075263,0,2024,0]
[11,2025,{"$f":"C16*(100%+Feuil1!$Z$41)","v":12252.518873532255},{"$f":"D16*(100%+Feuil1!$Z$41)","v":2681.1019488596694},{"$f":"E16*(100%+Feuil1!$Z$41)","v":1977.5094037339538},{"$f":"-IF(ISERROR(VLOOKUP(A17*12,Feuil1!$AQ$29:$AT$328,4,FALSE)),0,VLOOKUP(A17*12,Feuil1!$AQ$29:$AT$328,4,FALSE))","v":1281.8807556881295},6312.0267652505036,{"$f":"H16-VLOOKUP(Feuil1!$U$21,Feuil1!$T$6:$W$20,4)/10","v":4489.5060000000003},10461.656595507528,6312.0267652505036,4149.629830257024,0,2025,0]
[12,2026,{"$f":"C17*(100%+Feuil1!$Z$41)","v":12313.781467899915},{"$f":"D17*(100%+Feuil1!$Z$41)","v":2694.5074586039673},{"$f":"E17*(100%+Feuil1!$Z$41)","v":1987.3969507526233},{"$f":"-IF(ISERROR(VLOOKUP(A18*12,Feuil1!$AQ$29:$AT$328,4,FALSE)),0,VLOOKUP(A18*12,Feuil1!$AQ$29:$AT$328,4,FALSE))","v":1045.1610543651052},6586.7160041782181,{"$f":"H17","v":4489.5060000000003},8639.1358302570243,6586.7160041782181,2052.4198260788062,0,2026,0]
[13,2027,{"$f":"C18*(100%+Feuil1!$Z$41)","v":12375.350375239414},{"$f":"D18*(100%+Feuil1!$Z$41)","v":2707.979995896987},{"$f":"E18*(100%+Feuil1!$Z$41)","v":1997.3339355063863},{"$f":"-IF(ISERROR(VLOOKUP(A19*12,Feuil1!$AQ$29:$AT$328,4,FALSE)),0,VLOOKUP(A19*12,Feuil1!$AQ$29:$AT$328,4,FALSE))","v":803.22898814655377},6866.8074556894862,{"$f":"H18","v":4489.5060000000003},6541.9258260788065,6541.9258260788065,0,324.88162961067974,2027,1]
[14,2028,{"$f":"C19*(100%+Feuil1!$Z$41)","v":12437.22712711561},{"$f":"D19*(100%+Feuil1!$Z$41)","v":2721.5198958764718},{"$f":"E19*(100%+Feuil1!$Z$41)","v":2007.3206051839179},{"$f":"-IF(ISERROR(VLOOKUP(A20*12,Feuil1!$AQ$29:$AT$328,4,FALSE)),0,VLOOKUP(A20*12,Feuil1!$AQ$29:$AT$328,4,FALSE))","v":555.96978522576808},7152.4168408294518,4489.5060000000003,4489.5060000000003,4489.5060000000003,0,2662.9108408294514,2028,1]
{"$rows_left_out":19}
{"sheet":"Feuil3","index":2,"n_rows":36,"n_cols":12,"rows_kept":36,"cut":false,"hidden":false,"merged":[[20,11,20,13],[27,11,27,13],[28,11,31,13],[0,1,2,10],[3,1,5,1],[3,10,5,10],[3,9,5,9],[3,8,5,8],[3,6,5,6],[3,5,5,5],[3,4,5,4],[3,3,5,3],[3,2,5,2]]}
[null,"TRESORERIE"]
[]
[]
[null,"Années","Loyers","Charges","Taxe foncière et CET","Annuités emprunt","Solde","Epargne mensuelle","Loyers cumulés","Charges","Cumul charges"]
[null,null,null,null,null,null,null,"ou Revenu"]
[null,null,null,null,null,null,null,"mensuels"]
[1,{"$f":"YEAR(TODAY())","v":2015},{"$f":"Feuil1!E12*(12-Feuil1!$U$47)","v":11656.40859867464},{"$f":"-Feuil1!E13","v":-2550.6608178438664},{"$f":"-Feuil1!E14","v":-1881.29949894941},{"$f":"-IF(Feuil3!A7<=Feuil1!$V$36,Feuil1!$E$25*12,0)","v":-12032.512785028415},{"$f":"C7+D7+E7+F7","v":-4808.0645031470513},{"$f":"G7/12","v":-400.67204192892092},{"$f":"SUM($C$7:C7)","v":11656.40859867464},{"$f":"D7+E7+F7","v":-16464.473101821692},{"$f":"SUM($J$7:J7)","v":-16464.473101821692}]
[2,{"$f":"B7+1","v":2016},{"$f":"C7*(100%+Feuil1!$Z$41)","v":11714.690641668012},{"$f":"D7*(100%+Feuil1!$Z$41)","v":-2563.4141219330854},{"$f":"E7*(100%+Feuil1!$Z$41)","v":-1890.7059964441569},{"$f":"-IF(Feuil3!A8<=Feuil1!$V$36,Feuil1!$E$25*12,0)","v":-12032.512785028415},{"$f":"C8+D8+E8+F8","v":-4771.9422617376449},-397.66185514480372,{"$f":"SUM($C$7:C8)","v":23371.09924034265},{"$f":"D8+E8+F8","v":-16486.632903405658},{"$f":"SUM($J$7:J8)","v":-32951.106005227353}]
[3,{"$f":"B8+1","v":2017},{"$f":"C8*(100%+Feuil1!$Z$41)","v":11773.264094876351},{"$f":"D8*(100%+Feuil1!$Z$41)","v":-2576.2311925427507},{"$f":"E8*(100%+Feuil1!$Z$41)","v":-1900.1595264263774},{"$f":"-IF(Feuil3!A9<=Feuil1!$V$36,Feuil1!$E$25*12,0)","v":-12032.512785028415},-4735.6394091211932,-394.63661742676612,{"$f":"SUM($C$7:C9)","v":35144.363335219001},-16508.903503997542,{"$f":"SUM($J$7:J9)","v":-49460.009509224896}]
[4,2018,{"$f":"C9*(100%+Feuil1!$Z$41)","v":11832.130415350732},{"$f":"D9*(100%+Feuil1!$Z$41)","v":-2589.1123485054641},{"$f":"E9*(100%+Feuil1!$Z$41)","v":-1909.6603240585091},{"$f":"-IF(Feuil3!A10<=Feuil1!$V$36,Feuil1!$E$25*12,0)","v":-12032.512785028415},-4699.1550422416576,-391.59625352013813,{"$f":"SUM($C$7:C10)","v":46976.493750569731},-16531.285457592388,{"$f":"SUM($J$7:J10)","v":-65991.294966817281}]
[5,2019,{"$f":"C10*(100%+Feuil1!$Z$41)","v":11891.291067427484},{"$f":"D10*(100%+Feuil1!$Z$41)","v":-2602.057910247991},{"$f":"E10*(100%+Feuil1!$Z$41)","v":-1919.2086256788014},{"$f":"-IF(Feuil3!A11<=Feuil1!$V$36,Feuil1!$E$25*12,0)","v":-12032.512785028415},-4662.4882535277238,-388.54068779397699,{"$f":"SUM($C$7:C11)","v":58867.784817997213},-16553.779320955207,{"$f":"SUM($J$7:J11)","v":-82545.074287772484}]
[6,2020,{"$f":"C11*(100%+Feuil1!$Z$41)","v":11950.747522764621},{"$f":"D11*(100%+Feuil1!$Z$41)","v":-2615.0681997992306},{"$f":"E11*(100%+Feuil1!$Z$41)","v":-1928.8046688071952},{"$f":"-IF(Feuil3!A12<=Feuil1!$V$36,Feuil1!$E$25*12,0)","v":-12032.512785028415},-4625.6381308702203,-385.46984423918502,{"$f":"SUM($C$7:C12)","v":70818.532340761827},-16576.385653634839,{"$f":"SUM($J$7:J12)","v":-99121.459941407316}]
[7,2021,{"$f":"C12*(100%+Feuil1!$Z$41)","v":12010.501260378443},{"$f":"D12*(100%+Feuil1!$Z$41)","v":-2628.1435407982262},{"$f":"E12*(100%+Feuil1!$Z$41)","v":-1938.4486921512309},{"$f":"-IF(Feuil3!A13<=Feuil1!$V$36,Feuil1!$E$25*12,0)","v":-12032.512785028415},-4588.6037575994287,-382.38364646661904,{"$f":"SUM($C$7:C13)","v":82829.033601140269},-16599.105017977872,{"$f":"SUM($J$7:J13)","v":-115720.56495938518}]
[8,2022,{"$f":"C13*(100%+Feuil1!$Z$41)","v":12070.553766680334},{"$f":"D13*(100%+Feuil1!$Z$41)","v":-2641.2842585022172},{"$f":"E13*(100%+Feuil1!$Z$41)","v":-1948.1409356119868},{"$f":"-IF(Feuil3!A14<=Feuil1!$V$36,Feuil1!$E$25*12,0)","v":-12032.512785028415},-4551.3842124622852,-379.28201770519041,{"$f":"SUM($C$7:C14)","v":94899.587367820597},-16621.937979142618,{"$f":"SUM($J$7:J14)","v":-132342.50293852779}]
[9,2023,{"$f":"C14*(100%+Feuil1!$Z$41)","v":12130.906535513734},{"$f":"D14*(100%+Feuil1!$Z$41)","v":-2654.4906797947278},{"$f":"E14*(100%+Feuil1!$Z$41)","v":-1957.8816402900466},{"$f":"-IF(Feuil3!A15<=Feuil1!$V$36,Feuil1!$E$25*12,0)","v":-12032.512785028415},-4513.978569599456,-376.16488079995469,{"$f":"SUM($C$7:C15)","v":107030.49390333433},-16644.88510511319,{"$f":"SUM($J$7:J15)","v":-148987.38804364097}]
[10,2024,{"$f":"C15*(100%+Feuil1!$Z$41)","v":12191.5610681913},{"$f":"D15*(100%+Feuil1!$Z$41)","v":-2667.7631331937014},{"$f":"E15*(100%+Feuil1!$Z$41)","v":-1967.6710484914965},{"$f":"-IF(Feuil3!A16<=Feuil1!$V$36,Feuil1!$E$25*12,0)","v":-12032.512785028415},-4476.3858985223123,-373.03215821019268,{"$f":"SUM($C$7:C16)","v":119222.05497152562},-16667.946966713615,{"$f":"SUM($J$7:J16)","v":-165655.33501035458}]
[11,2025,{"$f":"C16*(100%+Feuil1!$Z$41)","v":12252.518873532255},{"$f":"D16*(100%+Feuil1!$Z$41)","v":-2681.1019488596694},{"$f":"E16*(100%+Feuil1!$Z$41)","v":-1977.5094037339538},{"$f":"-IF(Feuil3!A17<=Feuil1!$V$36,Feuil1!$E$25*12,0)","v":-12032.512785028415},-4438.6052640897824,-369.88377200748187,{"$f":"SUM($C$7:C17)","v":131474.57384505786},-16691.124137622039,{"$f":"SUM($J$7:J17)","v":-182346.45914797662}]
[12,2026,{"$f":"C17*(100%+Feuil1!$Z$41)","v":12313.781467899915},{"$f":"D17*(100%+Feuil1!$Z$41)","v":-2694.5074586039673},{"$f":"E17*(100%+Feuil1!$Z$41)","v":-1987.3969507526233},{"$f":"-IF(Feuil3!A18<=Feuil1!$V$36,Feuil1!$E$25*12,0)","v":-12032.512785028415},-4400.6357264850922,-366.71964387375766,{"$f":"SUM($C$7:C18)","v":143788.35531295778},-16714.417194385005,{"$f":"SUM($J$7:J18)","v":-199060.87634236162}]
[13,2027,{"$f":"C18*(100%+Feuil1!$Z$41)","v":12375.350375239414},{"$f":"D18*(100%+Feuil1!$Z$41)","v":-2707.979995896987},{"$f":"E18*(100%+Feuil1!$Z$41)","v":-1997.3339355063863},{"$f":"-IF(Feuil3!A19<=Feuil1!$V$36,Feuil1!$E$25*12,0)","v":-12032.512785028415},-4362.476341192375,-363.53969509936456,{"$f":"SUM($C$7:C19)","v":156163.70568819719},-16737.826716431788,{"$f":"SUM($J$7:J19)","v":-215798.70305879341}]
[14,2028,{"$f":"C19*(100%+Feuil1!$Z$41)","v":12437.22712711561},{"$f":"D19*(100%+Feuil1!$Z$41)","v":-2721.5198958764718},{"$f":"E19*(100%+Feuil1!$Z$41)","v":-2007.3206051839179},{"$f":"-IF(Feuil3!A20<=Feuil1!$V$36,Feuil1!$E$25*12,0)","v":-12032.512785028415},-4324.1261589731957,-360.34384658109963,{"$f":"SUM($C$7:C20)","v":168600.93281531282},-16761.353286088804,{"$f":"SUM($J$7:J20)","v":-232560.05634488221}]
{"$rows_left_out":16}